BDBM50275260 1-(oxazol-2-yl)-4-(1-(3-phenoxybenzyl)piperidin-4-yl)butan-1-one::CHEMBL486157
SMILES O=C(CCCC1CCN(Cc2cccc(Oc3ccccc3)c2)CC1)c1ncco1
InChI Key InChIKey=NVXBUMRWDYXPSY-UHFFFAOYSA-N
Data  1 IC50
  Tab Delimited (TSV)   2D SDfile   Computed 3D by Vconf -m prep SDfile
Find this compound or compounds like it in BindingDB:
Activity Spreadsheet -- Enzyme Inhibition Constant Data from BindingDB
Found 1 hit for monomerid = 50275260
TargetFatty-acid amide hydrolase 1(Homo sapiens (Human))
Johnson & Johnson Pharmaceutical Research And Development
Curated by ChEMBL
LigandPNGBDBM50275260(1-(oxazol-2-yl)-4-(1-(3-phenoxybenzyl)piperidin-4-...)
Affinity DataIC50:  0.400nM. Assay description: Inhibition of human FAAH
In DepthDetails ArticlePubMed