BDBM50275294 CHEMBL519721::[3,5-Dibromo-4-(4'-hydroxy-3'-isopropylphenoxy)]benzylphosphonicAcid
SMILES CC(C)c1cc(Oc2c(Br)cc(CP(O)(O)=O)cc2Br)ccc1O
InChI Key InChIKey=OKARMSOGGGWFDN-UHFFFAOYSA-N
Data  2 KI
  Tab Delimited (TSV)   2D SDfile   Computed 3D by Vconf -m prep SDfile
Find this compound or compounds like it in BindingDB:
Activity Spreadsheet -- Enzyme Inhibition Constant Data from BindingDB
Found 2 hits for monomerid = 50275294
TargetThyroid hormone receptor beta(Homo sapiens (Human))
Metabasis Therapeutics
Curated by ChEMBL
LigandPNGBDBM50275294(CHEMBL519721 | [3,5-Dibromo-4-(4'-hydroxy-3'-isopr...)
Affinity DataKi:  15.5nM. Assay description: Displacement of [125I]3,5,3'-triiodo-L-thyronine His-tagged human recombinant TRbeta1 by scintillation proximity assay
In DepthDetails ArticlePubMed
TargetThyroid hormone receptor alpha(Homo sapiens (Human))
Metabasis Therapeutics
Curated by ChEMBL
LigandPNGBDBM50275294(CHEMBL519721 | [3,5-Dibromo-4-(4'-hydroxy-3'-isopr...)
Affinity DataKi:  235nM. Assay description: Displacement of [125I]3,5,3'-triiodo-L-thyronine from His-tagged human recombinant TRalpha1 by scintillation proximity assay
In DepthDetails ArticlePubMed