BDBM50275378 3-(1H-indol-3-yl)-N-methyl-3-phenylpropan-1-amine::CHEMBL487763
SMILES CNCCC(c1c[nH]c2ccccc12)c1ccccc1
InChI Key InChIKey=HYXMIUGYZHSSJS-UHFFFAOYSA-N
Data  3 KI  2 IC50
  Tab Delimited (TSV)   2D SDfile   Computed 3D by Vconf -m prep SDfile
Find this compound or compounds like it in BindingDB:
Activity Spreadsheet -- Enzyme Inhibition Constant Data from BindingDB
Found 5 hits for monomerid = 50275378
TargetSodium-dependent serotonin transporter(Homo sapiens (Human))
Roche Palo Alto
Curated by ChEMBL
LigandPNGBDBM50275378(3-(1H-indol-3-yl)-N-methyl-3-phenylpropan-1-amine ...)
Affinity DataKi:  9nM. Assay description: Inhibition of SERT (unknown origin)
In DepthDetails ArticlePubMed
TargetSodium-dependent noradrenaline transporter(Homo sapiens (Human))
Roche Palo Alto
Curated by ChEMBL
LigandPNGBDBM50275378(3-(1H-indol-3-yl)-N-methyl-3-phenylpropan-1-amine ...)
Affinity DataKi:  89nM. Assay description: Inhibition of NET (unknown origin)
In DepthDetails ArticlePubMed
TargetSodium-dependent dopamine transporter(Homo sapiens (Human))
Roche Palo Alto
Curated by ChEMBL
LigandPNGBDBM50275378(3-(1H-indol-3-yl)-N-methyl-3-phenylpropan-1-amine ...)
Affinity DataKi: >1.40E+3nM. Assay description: Inhibition of DAT (unknown origin)
In DepthDetails ArticlePubMed
TargetCytochrome P450 2D6(Homo sapiens (Human))
Roche Palo Alto
Curated by ChEMBL
LigandPNGBDBM50275378(3-(1H-indol-3-yl)-N-methyl-3-phenylpropan-1-amine ...)
Affinity DataIC50:  3.10E+3nM. Assay description: Inhibition of CYP2D6 (unknown origin) by fluorescence based assay
In DepthDetails ArticlePubMed
TargetPotassium voltage-gated channel subfamily H member 2(Homo sapiens (Human))
Roche Palo Alto
Curated by ChEMBL
LigandPNGBDBM50275378(3-(1H-indol-3-yl)-N-methyl-3-phenylpropan-1-amine ...)
Affinity DataIC50:  1.00E+3nM. Assay description: Inhibition of human ERG expressed in CHO cells
In DepthDetails ArticlePubMed