BDBM50275570 CHEMBL519730::N-(4-chlorophenethyl)-N-(1-(2,4-difluorophenethyl)piperidin-4-yl)benzo[b]thiophene-3-carboxamide
SMILES Fc1ccc(CCN2CCC(CC2)N(CCc2ccc(Cl)cc2)C(=O)c2csc3ccccc23)c(F)c1
InChI Key InChIKey=JLGPWMZDUCEJTA-UHFFFAOYSA-N
Data  1 IC50
  Tab Delimited (TSV)   2D SDfile   Computed 3D by Vconf -m prep SDfile
Find this compound or compounds like it in BindingDB:
Activity Spreadsheet -- Enzyme Inhibition Constant Data from BindingDB
Found 1 hit for monomerid = 50275570
TargetC5a anaphylatoxin chemotactic receptor 1(Homo sapiens (Human))
Pfizer
Curated by ChEMBL
LigandPNGBDBM50275570(CHEMBL519730 | N-(4-chlorophenethyl)-N-(1-(2,4-dif...)
Affinity DataIC50:  200nM. Assay description: Displacement of [125I]r-hC5a from C5a receptor in cAMP differentiated human U937 cells
In DepthDetails ArticlePubMed