BDBM50275597 3-(4-(o-Tolylethynyl)phenyl)propanoic acid::CHEMBL449588
SMILES Cc1ccccc1C#Cc1ccc(CCC(O)=O)cc1
InChI Key InChIKey=FODHWOBAQBTTFS-UHFFFAOYSA-N
Data  1 KI  7 EC50
  Tab Delimited (TSV)   2D SDfile   Computed 3D by Vconf -m prep SDfile
Find this compound or compounds like it in BindingDB:
Activity Spreadsheet -- Enzyme Inhibition Constant Data from BindingDB
Found 8 hits for monomerid = 50275597
TargetFree fatty acid receptor 1(Homo sapiens (Human))
University Of Southern Denmark
Curated by ChEMBL
LigandPNGBDBM50275597(3-(4-(o-Tolylethynyl)phenyl)propanoic acid | CHEMB...)
Affinity DataKi:  631nM. Assay description: Displacement of 3-(2-Fluoro-4-((2'-methyl-4'-(2-(2-((7-nitrobenzo[c][1,2,5]-oxadiazol-4-yl)amino)ethoxy)ethoxy)-[1,1'-biphenyl]-3-yl)-methoxy)phenyl)...
In DepthDetails ArticlePubMed
TargetFree fatty acid receptor 1(Homo sapiens (Human))
University Of Southern Denmark
Curated by ChEMBL
LigandPNGBDBM50275597(3-(4-(o-Tolylethynyl)phenyl)propanoic acid | CHEMB...)
Affinity DataEC50:  68nM. Assay description: Agonist activity at human C-terminal eYFP-tagged FFA1 receptor expressed in HEK-293 cells assessed as beta-arrestin2 recruitment incubated for 5 mins...
In DepthDetails ArticlePubMed
TargetFree fatty acid receptor 1(Homo sapiens (Human))
University Of Southern Denmark
Curated by ChEMBL
LigandPNGBDBM50275597(3-(4-(o-Tolylethynyl)phenyl)propanoic acid | CHEMB...)
Affinity DataEC50:  45.7nM. Assay description: Agonist activity at human FFA1 receptor expressed in human 1321N1 cells assessed as calcium mobilization by fluorescence spectrophotometry
In DepthDetails ArticlePubMed
TargetFree fatty acid receptor 1(Homo sapiens (Human))
University Of Southern Denmark
Curated by ChEMBL
LigandPNGBDBM50275597(3-(4-(o-Tolylethynyl)phenyl)propanoic acid | CHEMB...)
Affinity DataEC50:  46nM. Assay description: Agonist activity at human FFA1 receptor transfected in human 1321N1 cells by calcium mobilization assay
In DepthDetails ArticlePubMed
TargetFree fatty acid receptor 4(Homo sapiens (Human))
University Of Southern Denmark
Curated by ChEMBL
LigandPNGBDBM50275597(3-(4-(o-Tolylethynyl)phenyl)propanoic acid | CHEMB...)
Affinity DataEC50:  2.24E+3nM. Assay description: Agonist activity at GPR120 expressed in HEK 293 cells assessed as beta-arrestin recruitment after 5 mins by BRET assay
In DepthDetails ArticlePubMed
TargetFree fatty acid receptor 1(Homo sapiens (Human))
University Of Southern Denmark
Curated by ChEMBL
LigandPNGBDBM50275597(3-(4-(o-Tolylethynyl)phenyl)propanoic acid | CHEMB...)
Affinity DataEC50:  46nM. Assay description: Agonist activity at human FFA1 assessed as calcium mobilization measured for 50 intervals of 0.4 secs by microplate reader analysis
In DepthDetails ArticlePubMed
TargetFree fatty acid receptor 1(Homo sapiens (Human))
University Of Southern Denmark
Curated by ChEMBL
LigandPNGBDBM50275597(3-(4-(o-Tolylethynyl)phenyl)propanoic acid | CHEMB...)
Affinity DataEC50:  32nM. Assay description: Agonist activity at human FFA1 expressed in human 1321N1 cells by calcium fluorescence assay
In DepthDetails ArticlePubMed
TargetFree fatty acid receptor 4(Homo sapiens (Human))
University Of Southern Denmark
Curated by ChEMBL
LigandPNGBDBM50275597(3-(4-(o-Tolylethynyl)phenyl)propanoic acid | CHEMB...)
Affinity DataEC50:  1.45E+3nM. Assay description: Agonist activity at C-terminal yellow fluorescent protein-fused human FFA4 receptor transfected in HEK293 cells after 5 mins by BRET assay
In DepthDetails ArticlePubMed