BDBM50275623 CHEMBL487356::N-(3-benzamido-1-phenyl-1H-1,2,4-triazol-5-yl)furan-2-carboxamide::cid_660706
SMILES O=C(Nc1nc(NC(=O)c2ccccc2)nn1-c1ccccc1)c1ccco1
InChI Key InChIKey=QUXWYCJKIJREBQ-UHFFFAOYSA-N
Data  2 IC50
  Tab Delimited (TSV)   2D SDfile   Computed 3D by Vconf -m prep SDfile
Find this compound or compounds like it in BindingDB:
Activity Spreadsheet -- Enzyme Inhibition Constant Data from BindingDB
Found 2 hits for monomerid = 50275623
TargetMitogen-activated protein kinase 1(Homo sapiens (Human))
Sejong University
Curated by ChEMBL
LigandPNGBDBM50275623(CHEMBL487356 | N-(3-benzamido-1-phenyl-1H-1,2,4-tr...)
Affinity DataIC50:  1.83E+4nM. Assay description: Inhibition of recombinant ERK2 (unknown origin)
In DepthDetails ArticlePubMed
TargetdTDP-4-dehydrorhamnose 3,5-epimerase(Mycobacterium tuberculosis H37Rv)
Pcmd
Curated by PubChem BioAssay
LigandPNGBDBM50275623(CHEMBL487356 | N-(3-benzamido-1-phenyl-1H-1,2,4-tr...)
Affinity DataIC50:  3.57E+3nM. Assay description: Molecular Library Screening Center Network (MLSCN) Penn Center for Molecular Discovery (PCMD) Assay Provider: Michael McNeil, Colorado State Universi...
In DepthDetails PCBioAssay