BDBM50275771 1S,2R-milnacipran::CHEMBL471001
SMILES CCN(CC)C(=O)[C@@]1(C[C@H]1CN)c1ccccc1
InChI Key InChIKey=GJJFMKBJSRMPLA-ZFWWWQNUSA-N
Data  7 IC50
  Tab Delimited (TSV)   2D SDfile   Computed 3D by Vconf -m prep SDfile
Find this compound or compounds like it in BindingDB:
Activity Spreadsheet -- Enzyme Inhibition Constant Data from BindingDB
Found 7 hits for monomerid = 50275771
TargetTransporter(Rattus norvegicus (rat))
Neurocrine Biosciences
Curated by ChEMBL
LigandPNGBDBM50275771(1S,2R-milnacipran | CHEMBL471001)
Affinity DataIC50:  16nM. Assay description: Displacement of Levo[ring-2,5,6-3H]norepinephrine from rat synaptosomal NET expressed in HEK293 cells by microplate scintillation counter
In DepthDetails ArticlePubMed
TargetSodium-dependent serotonin transporter(Rattus norvegicus (rat))
Neurocrine Biosciences
Curated by ChEMBL
LigandPNGBDBM50275771(1S,2R-milnacipran | CHEMBL471001)
Affinity DataIC50:  28nM. Assay description: Displacement of [alpha,beta-3H(N)]-5-hydroxytryptamine from rat synaptosomal SERT expressed in HEK293 cells by microplate scintillation counter
In DepthDetails ArticlePubMed
TargetSodium-dependent noradrenaline transporter(Homo sapiens (Human))
Neurocrine Biosciences
Curated by ChEMBL
LigandPNGBDBM50275771(1S,2R-milnacipran | CHEMBL471001)
Affinity DataIC50:  40nM. Assay description: Displacement of Levo[ring-2,5,6-3H]norepinephrine from human cloned NET expressed in HEK293 cells by microplate scintillation counter
In DepthDetails ArticlePubMed
TargetPotassium voltage-gated channel subfamily H member 2(Homo sapiens (Human))
Neurocrine Biosciences
Curated by ChEMBL
LigandPNGBDBM50275771(1S,2R-milnacipran | CHEMBL471001)
Affinity DataIC50: >1.00E+4nM. Assay description: Inhibition of human ERG expressed in HEK293 cells by patch-clamp method
In DepthDetails ArticlePubMed
TargetSodium-dependent dopamine transporter(Homo sapiens (Human))
Neurocrine Biosciences
Curated by ChEMBL
LigandPNGBDBM50275771(1S,2R-milnacipran | CHEMBL471001)
Affinity DataIC50:  3.20E+3nM. Assay description: Displacement of 3,4-[ring-2,5,6-3H]dihydroxyphenylethylamine from human cloned DAT expressed in HEK293 cells by microplate scintillation counter
In DepthDetails ArticlePubMed
TargetSodium-dependent dopamine transporter(Rattus norvegicus (rat))
Neurocrine Biosciences
Curated by ChEMBL
LigandPNGBDBM50275771(1S,2R-milnacipran | CHEMBL471001)
Affinity DataIC50:  2.00E+4nM. Assay description: Displacement of 3,4-[ring-2,5,6-3H]dihydroxyphenylethylamine from rat synaptosomal DAT expressed in HEK293 cells by microplate scintillation counter
In DepthDetails ArticlePubMed
TargetSodium-dependent serotonin transporter(Homo sapiens (Human))
Neurocrine Biosciences
Curated by ChEMBL
LigandPNGBDBM50275771(1S,2R-milnacipran | CHEMBL471001)
Affinity DataIC50:  320nM. Assay description: Displacement of [alpha,beta-3H(N)]-5-hydroxytryptamine from human cloned SERT expressed in HEK293 cells by microplate scintillation counter
In DepthDetails ArticlePubMed