BDBM50275832 CHEMBL512477::N-(2-(pyridin-2-yl)ethyl)-N-(1,4-dioxaspiro[4.5]decan-8-yl)benzo[b]thiophene-3-carboxamide
SMILES O=C(N(CCc1ccccn1)C1CCC2(CC1)OCCO2)c1csc2ccccc12
InChI Key InChIKey=KGXIRYLCSRTUEO-UHFFFAOYSA-N
Data  1 IC50
  Tab Delimited (TSV)   2D SDfile   Computed 3D by Vconf -m prep SDfile
Find this compound or compounds like it in BindingDB:
Activity Spreadsheet -- Enzyme Inhibition Constant Data from BindingDB
Found 1 hit for monomerid = 50275832
TargetC5a anaphylatoxin chemotactic receptor 1(Homo sapiens (Human))
Pfizer
Curated by ChEMBL
LigandPNGBDBM50275832(CHEMBL512477 | N-(2-(pyridin-2-yl)ethyl)-N-(1,4-di...)
Affinity DataIC50: >1.00E+3nM. Assay description: Displacement of [125I]r-hC5a from C5a receptor in cAMP differentiated human U937 cells
In DepthDetails ArticlePubMed