BDBM50276166 CHEMBL469932::Carbamic acid (4E,10E)-(8S,9S,12S,13R,14S,16R)-13-hydroxy-8,14-dimethoxy-4,10,12,16-tetramethyl-3-oxo-2-aza-bicyclo[16.3.1]docosa-1(22),4,10,18,20-pentaen-9-yl ester
SMILES CO[C@H]1CC\C=C(C)\C(=O)Nc2cccc(C[C@@H](C)C[C@H](OC)[C@H](O)[C@@H](C)\C=C(C)\[C@@H]1OC(N)=O)c2
InChI Key InChIKey=VSRDDIXOACNXNB-DULVUOHVSA-N
Data  1 Kd
  Tab Delimited (TSV)   2D SDfile   Computed 3D by Vconf -m prep SDfile
Find this compound or compounds like it in BindingDB:
Activity Spreadsheet -- Enzyme Inhibition Constant Data from BindingDB
Found 1 hit for monomerid = 50276166
TargetHeat shock protein HSP 90-alpha(Homo sapiens (Human))
Kosan Biosciences
Curated by ChEMBL
LigandPNGBDBM50276166(CHEMBL469932 | Carbamic acid (4E,10E)-(8S,9S,12S,1...)
Affinity DataKd:  5.40nM. Assay description: Binding affinity to human recombinant Hsp90alpha N-terminal domain by isothermal titration calorimetry
In DepthDetails ArticlePubMed