BDBM50276629 2-chloro-4-(5-(4-ethoxyphenyl)-1,2,3-thiadiazol-4-yl)-6-ethylbenzene-1,3-diol::CHEMBL515820
SMILES CCOc1ccc(cc1)-c1snnc1-c1cc(CC)c(O)c(Cl)c1O
InChI Key InChIKey=YLKROOFSLDEUBO-UHFFFAOYSA-N
Data  1 Kd
  Tab Delimited (TSV)   2D SDfile   Computed 3D by Vconf -m prep SDfile
Find this compound or compounds like it in BindingDB:
Activity Spreadsheet -- Enzyme Inhibition Constant Data from BindingDB
Found 1 hit for monomerid = 50276629
TargetHeat shock protein HSP 90-alpha(Homo sapiens (Human))
Fermentas
Curated by ChEMBL
LigandPNGBDBM50276629(2-chloro-4-(5-(4-ethoxyphenyl)-1,2,3-thiadiazol-4-...)
Affinity DataKd: >2.00E+4nM. Assay description: Binding affinity to human full length Histidine6-tagged Hsp90alpha expressed in Escherichia coli BL21 DE3 by ITC
In DepthDetails ArticlePubMed