BDBM50276772 CHEMBL456011::N-(3-benzyl-5-phenyl-3H-[1,2,3]triazolo[4,5-d]pyrimidin-7-yl)thiophene-2-carboxamide
SMILES O=C(Nc1nc(nc2n(Cc3ccccc3)nnc12)-c1ccccc1)c1cccs1
InChI Key InChIKey=SNIUMEAFFOTCJB-UHFFFAOYSA-N
Data  3 KI
  Tab Delimited (TSV)   2D SDfile   Computed 3D by Vconf -m prep SDfile
Find this compound or compounds like it in BindingDB:
Activity Spreadsheet -- Enzyme Inhibition Constant Data from BindingDB
Found 3 hits for monomerid = 50276772
TargetAdenosine receptor A1(Rattus norvegicus (rat))
Università
Curated by ChEMBL
LigandPNGBDBM50276772(CHEMBL456011 | N-(3-benzyl-5-phenyl-3H-[1,2,3]tria...)
Affinity DataKi:  8nM. Assay description: Displacement of [3H]DPCPX from adenosine A1 receptor in Wistar rat brain cortex by liquid scintillation counting
In DepthDetails ArticlePubMed
TargetAdenosine receptor A2a(Homo sapiens (Human))
Università
Curated by ChEMBL
LigandPNGBDBM50276772(CHEMBL456011 | N-(3-benzyl-5-phenyl-3H-[1,2,3]tria...)
Affinity DataKi:  305nM. Assay description: Displacement of [3H]ZM241385 from human recombinant adenosine A2A receptor expressed in CHO cells by liquid scintillation counting
In DepthDetails ArticlePubMed
TargetAdenosine receptor A3(Homo sapiens (Human))
Università
Curated by ChEMBL
LigandPNGBDBM50276772(CHEMBL456011 | N-(3-benzyl-5-phenyl-3H-[1,2,3]tria...)
Affinity DataKi:  2.29E+3nM. Assay description: Displacement of [3H]NECA from human recombinant adenosine A3 receptor expressed in CHO cells by liquid scintillation counting
In DepthDetails ArticlePubMed