BDBM50277190 (S)-6-methyl-N-(2-(thiazol-2-ylmethylamino)-2,3-dihydro-1H-inden-5-yl)-4'-(trifluoromethyl)biphenyl-2-carboxamide::CHEMBL474893
SMILES Cc1cccc(C(=O)Nc2ccc3C[C@@H](Cc3c2)NCc2nccs2)c1-c1ccc(cc1)C(F)(F)F
InChI Key InChIKey=BDOBNHGYFGVFDD-QHCPKHFHSA-N
Data  3 IC50
  Tab Delimited (TSV)   2D SDfile   Computed 3D by Vconf -m prep SDfile
Find this compound or compounds like it in BindingDB:
Activity Spreadsheet -- Enzyme Inhibition Constant Data from BindingDB
Found 3 hits for monomerid = 50277190
TargetSmoothened homolog(Mus musculus)
Novartis Institutes For Biomedical Research
Curated by ChEMBL
LigandPNGBDBM50277190((S)-6-methyl-N-(2-(thiazol-2-ylmethylamino)-2,3-di...)
Affinity DataIC50:  10nM. Assay description: Antagonist activity at mouse Smo receptor expressed in CHO cells by [3H]Hh-Ag binding assay
In DepthDetails ArticlePubMed
TargetMicrosomal triglyceride transfer protein large subunit(Homo sapiens (Human))
Novartis Institutes For Biomedical Research
Curated by ChEMBL
LigandPNGBDBM50277190((S)-6-methyl-N-(2-(thiazol-2-ylmethylamino)-2,3-di...)
Affinity DataIC50:  140nM. Assay description: Inhibition of MTP in human HepG2 cells assessed as apolipoprotein B production by ELISA
In DepthDetails ArticlePubMed
TargetSmoothened homolog(Homo sapiens (Human))
Novartis Institutes For Biomedical Research
Curated by ChEMBL
LigandPNGBDBM50277190((S)-6-methyl-N-(2-(thiazol-2-ylmethylamino)-2,3-di...)
Affinity DataIC50:  30nM. Assay description: Antagonist activity at human Smo receptor expressed in CHO cells by [3H]Hh-Ag binding assay
In DepthDetails ArticlePubMed