BDBM50277481 3-(Cyclohexylmethyl)-4'-(2-{[(2R)-2-hydroxy-2-phenylethyl]amino}-ethyl)-N-(methylsulfonyl)biphenyl-4-carboxamide Hydrochloride::CHEMBL513419
SMILES CS(=O)(=O)NC(=O)c1ccc(cc1CC1CCCCC1)-c1ccc(CCNC[C@H](O)c2ccccc2)cc1
InChI Key InChIKey=SQUQUNHXHNATKL-PMERELPUSA-N
Data  2 EC50
  Tab Delimited (TSV)   2D SDfile   Computed 3D by Vconf -m prep SDfile
Find this compound or compounds like it in BindingDB:
Activity Spreadsheet -- Enzyme Inhibition Constant Data from BindingDB
Found 2 hits for monomerid = 50277481
TargetBeta-1 adrenergic receptor(Homo sapiens (Human))
Astellas Pharma
Curated by ChEMBL
LigandPNGBDBM50277481(3-(Cyclohexylmethyl)-4'-(2-{[(2R)-2-hydroxy-2-phen...)
Affinity DataEC50:  370nM. Assay description: Agonist activity at human recombinant beta-1 adrenergic receptor expressed in CHO cells assessed as cAMP accumulation by enzyme immunoassay
In DepthDetails ArticlePubMed
TargetBeta-3 adrenergic receptor(Homo sapiens (Human))
Astellas Pharma
Curated by ChEMBL
LigandPNGBDBM50277481(3-(Cyclohexylmethyl)-4'-(2-{[(2R)-2-hydroxy-2-phen...)
Affinity DataEC50:  0.540nM. Assay description: Agonist activity at human recombinant beta3 adrenergic receptor expressed in CHO cells assessed as cAMP accumulation by enzyme immunoassay
In DepthDetails ArticlePubMed