BDBM50277528 4'-(2-{[(2R)-2-Hydroxy-2-phenylethyl]amino}ethyl)-3-methoxy-N-(methylsulfonyl)biphenyl-4-carboxamide Hydrochloride::CHEMBL470858
SMILES COc1cc(ccc1C(=O)NS(C)(=O)=O)-c1ccc(CCNC[C@H](O)c2ccccc2)cc1
InChI Key InChIKey=MRVSKUVBXIQNLC-QHCPKHFHSA-N
Data  2 EC50
  Tab Delimited (TSV)   2D SDfile   Computed 3D by Vconf -m prep SDfile
Find this compound or compounds like it in BindingDB:
Activity Spreadsheet -- Enzyme Inhibition Constant Data from BindingDB
Found 2 hits for monomerid = 50277528
TargetBeta-1 adrenergic receptor(Homo sapiens (Human))
Astellas Pharma
Curated by ChEMBL
LigandPNGBDBM50277528(4'-(2-{[(2R)-2-Hydroxy-2-phenylethyl]amino}ethyl)-...)
Affinity DataEC50:  730nM. Assay description: Agonist activity at human recombinant beta-1 adrenergic receptor expressed in CHO cells assessed as cAMP accumulation by enzyme immunoassay
In DepthDetails ArticlePubMed
TargetBeta-3 adrenergic receptor(Homo sapiens (Human))
Astellas Pharma
Curated by ChEMBL
LigandPNGBDBM50277528(4'-(2-{[(2R)-2-Hydroxy-2-phenylethyl]amino}ethyl)-...)
Affinity DataEC50:  18nM. Assay description: Agonist activity at human recombinant beta3 adrenergic receptor expressed in CHO cells assessed as cAMP accumulation by enzyme immunoassay
In DepthDetails ArticlePubMed