BDBM50277958 (R)-5-methyl-3-(4-(pyridin-4-yl)benzyl)oxazolidin-2-one::CHEMBL520300
SMILES C[C@@H]1CN(Cc2ccc(cc2)-c2ccncc2)C(=O)O1
InChI Key InChIKey=CCCHHGSPZLGUAW-GFCCVEGCSA-N
Data  1 EC50
  Tab Delimited (TSV)   2D SDfile   Computed 3D by Vconf -m prep SDfile
Find this compound or compounds like it in BindingDB:
Activity Spreadsheet -- Enzyme Inhibition Constant Data from BindingDB
Found 1 hit for monomerid = 50277958
TargetMetabotropic glutamate receptor 2(Homo sapiens (Human))
Pfizer
Curated by ChEMBL
LigandPNGBDBM50277958((R)-5-methyl-3-(4-(pyridin-4-yl)benzyl)oxazolidin-...)
Affinity DataEC50:  4.79E+3nM. Assay description: Agonist activity at mGluR2 (unknown origin) expressed in HEK cells by FLIPR assay in presence of glutamate
In DepthDetails ArticlePubMed