BDBM50278114 CHEMBL513012::N-cyclohexylquinazolin-4-amine
SMILES C1CCC(CC1)Nc1ncnc2ccccc12
InChI Key InChIKey=CIFOBGKTSPXVQX-UHFFFAOYSA-N
Data  1 KI
  Tab Delimited (TSV)   2D SDfile   Computed 3D by Vconf -m prep SDfile
Find this compound or compounds like it in BindingDB:
Activity Spreadsheet -- Enzyme Inhibition Constant Data from BindingDB
Found 1 hit for monomerid = 50278114
TargetMetabotropic glutamate receptor 1(RAT)
Medical Research Council Technology
Curated by ChEMBL
LigandPNGBDBM50278114(CHEMBL513012 | N-cyclohexylquinazolin-4-amine)
Affinity DataKi:  27nM. Assay description: Antagonist activity at rat mGluR1a expressed in CHO cells assessed as inhibition of glutamate-evoked increase in calcium internalization preincubated...
In DepthDetails ArticlePubMed