BDBM50278605 CHEMBL512858::N-(2-amino-1-phenylethyl)-4-cyclopropyl-5-(1H-pyrrolo[2,3-b]pyridin-4-yl)thiophene-2-carboxamide
SMILES NCC(NC(=O)c1cc(C2CC2)c(s1)-c1ccnc2[nH]ccc12)c1ccccc1
InChI Key InChIKey=ZXAIWDLCJKVDIG-UHFFFAOYSA-N
Data  1 IC50
  Tab Delimited (TSV)   2D SDfile   Computed 3D by Vconf -m prep SDfile
Find this compound or compounds like it in BindingDB:
Activity Spreadsheet -- Enzyme Inhibition Constant Data from BindingDB
Found 1 hit for monomerid = 50278605
TargetRAC-alpha serine/threonine-protein kinase(Homo sapiens (Human))
Glaxosmithkline
Curated by ChEMBL
LigandPNGBDBM50278605(CHEMBL512858 | N-(2-amino-1-phenylethyl)-4-cyclopr...)
Affinity DataIC50:  6nM. Assay description: Inhibition of AKT1
In DepthDetails ArticlePubMed