BDBM50278744 (+/-)-cis-6-((4-(2-(3-Fluorophenethoxy)ethylamino)pyrrolidin-3-yl)methyl)-4-methyl-pyridin-2-amine::CHEMBL512136
SMILES Cc1cc(N)nc(C[C@H]2CNC[C@H]2NCCOCCc2cccc(F)c2)c1
InChI Key InChIKey=AQFHFNHZQKRGMW-FXAWDEMLSA-N
Data  3 KI
  Tab Delimited (TSV)   2D SDfile   Computed 3D by Vconf -m prep SDfile
Find this compound or compounds like it in BindingDB:
Activity Spreadsheet -- Enzyme Inhibition Constant Data from BindingDB
Found 3 hits for monomerid = 50278744
TargetNitric oxide synthase, brain(Rattus norvegicus (rat))
Northwestern University
Curated by ChEMBL
LigandPNGBDBM50278744((+/-)-cis-6-((4-(2-(3-Fluorophenethoxy)ethylamino)...)
Affinity DataKi:  400nM. Assay description: Inhibition of rat recombinant nNOS expressed in Escherichia coli assessed as nitric oxide formation by hemoglobin capture assay
In DepthDetails ArticlePubMed
TargetNitric oxide synthase, inducible(Mus musculus (mouse))
Northwestern University
Curated by ChEMBL
LigandPNGBDBM50278744((+/-)-cis-6-((4-(2-(3-Fluorophenethoxy)ethylamino)...)
Affinity DataKi:  4.00E+3nM. Assay description: Inhibition of mouse recombinant iNOS expressed in Escherichia coli assessed as nitric oxide formation by hemoglobin capture assay
In DepthDetails ArticlePubMed
TargetNitric oxide synthase, endothelial(Bos taurus (bovine))
Northwestern University
Curated by ChEMBL
LigandPNGBDBM50278744((+/-)-cis-6-((4-(2-(3-Fluorophenethoxy)ethylamino)...)
Affinity DataKi:  3.30E+4nM. Assay description: Inhibition of bovine recombinant eNOS expressed in Escherichia coli assessed as nitric oxide formation by hemoglobin capture assay
In DepthDetails ArticlePubMed