BDBM50278824 CHEMBL4164183
SMILES [H][C@@]1(CC[C@@]2([H])C3=CC[C@@]4([H])C[C@@H](O)CC[C@]4(C)[C@@]3([H])CC[C@]12C)[C@H](C)CO
InChI Key InChIKey=IVAOADXYWQWGGB-ZQBDSGMFSA-N
Data  1 IC50
  Tab Delimited (TSV)   2D SDfile   Computed 3D by Vconf -m prep SDfile
Find this compound or compounds like it in BindingDB:
Activity Spreadsheet -- Enzyme Inhibition Constant Data from BindingDB
Found 1 hit for monomerid = 50278824
TargetDelta(24)-sterol reductase(Homo sapiens)
Ludwig-Maximilians-University Munich
Curated by ChEMBL
LigandPNGBDBM50278824(CHEMBL4164183)
Affinity DataIC50:  0.100nM. Assay description: Inhibition of DHCR24-mediated cholesterol biosynthesis in human HL60 cells assessed as inhibition of 2-[13C]acetate incorporation into newly synthesi...
In DepthDetails ArticlePubMed