BDBM50279393 (+/-)-6-((4-(2-(3-fluorophenethoxy)ethylamino)pyrrolidin-3-yl)methyl)-4-methylpyridin-2-amine::CHEMBL484825
SMILES Cc1cc(N)nc(CC2CNCC2NCCOCCc2cccc(F)c2)c1
InChI Key InChIKey=AQFHFNHZQKRGMW-UHFFFAOYSA-N
Data  2 IC50
  Tab Delimited (TSV)   2D SDfile   Computed 3D by Vconf -m prep SDfile
Find this compound or compounds like it in BindingDB:
Activity Spreadsheet -- Enzyme Inhibition Constant Data from BindingDB
Found 2 hits for monomerid = 50279393
TargetNitric oxide synthase, brain(Homo sapiens (Human))
Northwestern University
Curated by ChEMBL
LigandPNGBDBM50279393((+/-)-6-((4-(2-(3-fluorophenethoxy)ethylamino)pyrr...)
Affinity DataIC50:  6.60E+3nM. Assay description: Inhibition of human nNOS by hemoglobin capture assay
In DepthDetails ArticlePubMed
TargetNitric oxide synthase, brain(Rattus norvegicus (rat))
Northwestern University
Curated by ChEMBL
LigandPNGBDBM50279393((+/-)-6-((4-(2-(3-fluorophenethoxy)ethylamino)pyrr...)
Affinity DataIC50:  2.90E+3nM. Assay description: Inhibition of wild type rat nNOS by hemoglobin capture assay
In DepthDetails ArticlePubMed