BDBM50280485 CHEMBL157667::[Hydroxy-(4-methoxy-phenyl)-phosphono-methyl]-phosphonic acid
SMILES COc1ccc(cc1)C(O)(P(O)(O)=O)P(O)(O)=O
InChI Key InChIKey=BXSGTKXRDIDZHN-UHFFFAOYSA-N
Data  1 IC50
  Tab Delimited (TSV)   2D SDfile   Computed 3D by Vconf -m prep SDfile
Find this compound or compounds like it in BindingDB:
Activity Spreadsheet -- Enzyme Inhibition Constant Data from BindingDB
Found 1 hit for monomerid = 50280485
TargetInositol monophosphatase 1(Bos taurus)
TBA
Curated by ChEMBL
LigandPNGBDBM50280485(CHEMBL157667 | [Hydroxy-(4-methoxy-phenyl)-phospho...)
Affinity DataIC50:  4.00E+4nM. Assay description: Concentration required for 50% inhibition of Inositol monophosphatase
In DepthDetails Article