BDBM50280573 1-Aza-bicyclo[2.2.1]heptan-3-one O-hex-5-en-2-ynyl-oxime::CHEMBL169011
SMILES C=CCC#CCO\N=C1/CN2CCC1C2
InChI Key InChIKey=ULKQDBVLZBWBAW-OUKQBFOZSA-N
Data  3 IC50
  Tab Delimited (TSV)   2D SDfile   Computed 3D by Vconf -m prep SDfile
Find this compound or compounds like it in BindingDB:
Activity Spreadsheet -- Enzyme Inhibition Constant Data from BindingDB
Found 3 hits for monomerid = 50280573
TargetMuscarinic acetylcholine receptor M2(Homo sapiens (Human))
TBA
Curated by ChEMBL
LigandPNGBDBM50280573(1-Aza-bicyclo[2.2.1]heptan-3-one O-hex-5-en-2-ynyl...)
Affinity DataIC50:  1.59E+4nM. Assay description: Inhibitory activity against human Muscarinic acetylcholine receptor M2 using [3H]-quinuclidinyl benzilate to label antagonist site (RQNB) in CHO cell...
In DepthDetails Article
LigandPNGBDBM50280573(1-Aza-bicyclo[2.2.1]heptan-3-one O-hex-5-en-2-ynyl...)
Affinity DataIC50:  32nM. Assay description: Effective concentration for HMPA (human muscarinic inositol phosphate accumulation) activity measured in CHO cells expressing Muscarinic acetylcholin...
In DepthDetails Article
TargetMuscarinic acetylcholine receptor M1(Homo sapiens (Human))
TBA
Curated by ChEMBL
LigandPNGBDBM50280573(1-Aza-bicyclo[2.2.1]heptan-3-one O-hex-5-en-2-ynyl...)
Affinity DataIC50:  9.44E+3nM. Assay description: Inhibitory activity against human Muscarinic acetylcholine receptor M1 using [3H]-quinuclidinyl benzilate to label antagonist site (RQNB) in CHO cell...
In DepthDetails Article