BDBM50280608 (2-Morpholin-4-yl-ethyl)-(6-phenyl-5-propyl-pyridazin-3-yl)-amine::CHEMBL355350
SMILES CCCc1cc(NCCN2CCOCC2)nnc1-c1ccccc1
InChI Key InChIKey=AVESSXICDLPQQI-UHFFFAOYSA-N
Data  1 IC50
  Tab Delimited (TSV)   2D SDfile   Computed 3D by Vconf -m prep SDfile
Find this compound or compounds like it in BindingDB:
Activity Spreadsheet -- Enzyme Inhibition Constant Data from BindingDB
Found 1 hit for monomerid = 50280608
LigandPNGBDBM50280608((2-Morpholin-4-yl-ethyl)-(6-phenyl-5-propyl-pyrida...)
Affinity DataIC50:  1.60E+3nM. Assay description: Displacement of [3H]-pirenzepine from cerebral Muscarinic acetylcholine receptor M1
In DepthDetails Article