BDBM50280826 2-{2-[4-(5-Fluoro-1H-indol-3-ylmethyl)-piperidin-1-yl]-ethyl}-2,3-dihydro-benzo[d]isothiazole 1,1-dioxide::CHEMBL57483
SMILES Fc1ccc2[nH]cc(CC3CCN(CCN4Cc5ccccc5S4(=O)=O)CC3)c2c1
InChI Key InChIKey=WABVGRGYPGCSGJ-UHFFFAOYSA-N
Data  4 IC50
  Tab Delimited (TSV)   2D SDfile   Computed 3D by Vconf -m prep SDfile
Find this compound or compounds like it in BindingDB:
Activity Spreadsheet -- Enzyme Inhibition Constant Data from BindingDB
Found 4 hits for monomerid = 50280826
TargetD(2) dopamine receptor(Mus musculus (Mouse))
TBA
Curated by ChEMBL
LigandPNGBDBM50280826(2-{2-[4-(5-Fluoro-1H-indol-3-ylmethyl)-piperidin-1...)
Affinity DataIC50: >100nM. Assay description: Tested for its binding affinity against Dopamine receptor D2; showed no appreciable affinity at concentration specified
In DepthDetails Article
LigandPNGBDBM50280826(2-{2-[4-(5-Fluoro-1H-indol-3-ylmethyl)-piperidin-1...)
Affinity DataIC50:  1nM. Assay description: Compound was evaluated for inhibition of 5-HT uptake by measuring its ability to inhibit [3H]paroxetine binding to rat cortical membranes
In DepthDetails Article
TargetMuscarinic acetylcholine receptor M1/M2/M3/M4/M5(Homo sapiens (Human))
TBA
Curated by ChEMBL
LigandPNGBDBM50280826(2-{2-[4-(5-Fluoro-1H-indol-3-ylmethyl)-piperidin-1...)
Affinity DataIC50: >100nM. Assay description: Tested for its binding affinity against muscarinic receptor; showed no appreciable affinity at concentration specified
In DepthDetails Article
TargetAlpha-1A/Alpha-1B/Alpha-1D adrenergic receptor(Mus musculus (Mouse))
TBA
Curated by ChEMBL
LigandPNGBDBM50280826(2-{2-[4-(5-Fluoro-1H-indol-3-ylmethyl)-piperidin-1...)
Affinity DataIC50: >100nM. Assay description: Tested for its binding affinity against Alpha-1 adrenergic receptor; showed no appreciable affinity at concentration specified
In DepthDetails Article