BDBM50281124 1-(3-Ethyl-phenyl)-2,2,2-trifluoro-ethanone::CHEMBL315634
SMILES CCc1cccc(c1)C(=O)C(F)(F)F
InChI Key InChIKey=PJSYSOFHIVILHS-UHFFFAOYSA-N
Data  1 KI
  Tab Delimited (TSV)   2D SDfile   Computed 3D by Vconf -m prep SDfile
Find this compound or compounds like it in BindingDB:
Activity Spreadsheet -- Enzyme Inhibition Constant Data from BindingDB
Found 1 hit for monomerid = 50281124
TargetAcetylcholinesterase(Tetronarce californica (Pacific electric ray) (Tor...)
TBA
Curated by ChEMBL
LigandPNGBDBM50281124(1-(3-Ethyl-phenyl)-2,2,2-trifluoro-ethanone | CHEM...)
Affinity DataKi:  0.390nM. Assay description: Tested for the ability to inhibit Acetylcholinesterase (AChE) from Torpedo californica
In DepthDetails Article