BDBM50281128 (S)-2-{4-[2-(4-Oxo-3,4,5,6,7,8-hexahydro-pyrido[2,3-d]pyrimidin-6-yl)-ethyl]-benzoylamino}-pentanedioic acid::CHEMBL88929
SMILES OC(=O)CC[C@H](NC(=O)c1ccc(CCC2CNc3nc[nH]c(=O)c3C2)cc1)C(O)=O
InChI Key InChIKey=UCHCGCQTCQNVGW-UHFFFAOYSA-N
Data  2 KI
  Tab Delimited (TSV)   2D SDfile   Computed 3D by Vconf -m prep SDfile
Find this compound or compounds like it in BindingDB:
Activity Spreadsheet -- Enzyme Inhibition Constant Data from BindingDB
Found 2 hits for monomerid = 50281128
LigandPNGBDBM50281128((S)-2-{4-[2-(4-Oxo-3,4,5,6,7,8-hexahydro-pyrido[2,...)
Affinity DataKi:  2.70E+4nM. Assay description: Tested for the inhibition of trifunctional Glycinamide ribonucleotide formyltransferase isolated from murine L1210 cells.
In DepthDetails Article
TargetTrifunctional purine biosynthetic protein adenosine-3(Homo sapiens (Human))
TBA
Curated by ChEMBL
LigandPNGBDBM50281128((S)-2-{4-[2-(4-Oxo-3,4,5,6,7,8-hexahydro-pyrido[2,...)
Affinity DataKi:  8.21E+4nM. Assay description: Tested for the inhibition of recombinant human monofunctional Glycinamide ribonucleotide formyltransferase
In DepthDetails Article