BDBM50281222 (S)-N-[(S)-4-((S,R)-Butylsulfamoyl)-1-cyclohexylmethyl-2,3-dihydroxy-butyl]-3-(3H-imidazol-4-yl)-2-(3-phenyl-propionylamino)-propionamide::CHEMBL276749
SMILES CCCCNS(=O)(=O)C[C@@H](O)[C@H](O)[C@H](CC1CCCCC1)NC(=O)[C@H](Cc1cnc[nH]1)NC(=O)CCc1ccccc1
InChI Key InChIKey=VKIYJLZLTJGKEQ-YJIPECKFSA-N
Data  1 IC50
  Tab Delimited (TSV)   2D SDfile   Computed 3D by Vconf -m prep SDfile
Find this compound or compounds like it in BindingDB:
Activity Spreadsheet -- Enzyme Inhibition Constant Data from BindingDB
Found 1 hit for monomerid = 50281222
TargetRenin(Homo sapiens (Human))
TBA
Curated by ChEMBL
LigandPNGBDBM50281222((S)-N-[(S)-4-((S,R)-Butylsulfamoyl)-1-cyclohexylme...)
Affinity DataIC50:  2.10E+4nMpH: 7.0Assay Description:The compound was tested for its inhibitory activity against human renal renin at pH 7
In DepthDetails Article