BDBM50281226 CHEMBL328736::N-[(S)-1-[(2R,3S)-4-((R)-Butylsulfamoyl)-1-cyclohexylmethyl-2,3-dihydroxy-butylcarbamoyl]-2-(3H-imidazol-4-yl)-ethyl]-2-(2-methyl-propane-2-sulfonylmethyl)-3-(S)-phenyl-propionamide
SMILES CCCCNS(=O)(=O)C[C@H](O)[C@H](O)[C@H](CC1CCCCC1)NC(=O)[C@H](Cc1cnc[nH]1)NC(=O)[C@H](Cc1ccccc1)CS(=O)(=O)C(C)(C)C
InChI Key InChIKey=ZIMBBOOTTYBWFG-QMVABORWSA-N
Data  1 IC50
  Tab Delimited (TSV)   2D SDfile   Computed 3D by Vconf -m prep SDfile
Find this compound or compounds like it in BindingDB:
Activity Spreadsheet -- Enzyme Inhibition Constant Data from BindingDB
Found 1 hit for monomerid = 50281226
TargetRenin(Homo sapiens (Human))
TBA
Curated by ChEMBL
LigandPNGBDBM50281226(CHEMBL328736 | N-[(S)-1-[(2R,3S)-4-((R)-Butylsulfa...)
Affinity DataIC50:  0.350nMpH: 7.0Assay Description:The compound was tested for its inhibitory activity against human renal renin at pH 7
In DepthDetails Article