BDBM50281473 (3-Benzylcarbamoyl-3,3-difluoro-2-oxo-1-trimethylsilanylmethyl-propyl)-carbamic acid benzyl ester::CHEMBL86686
SMILES C[Si](C)(C)CC(NC(=O)OCc1ccccc1)C(=O)C(F)(F)C(=O)NCc1ccccc1
InChI Key InChIKey=ASOGAPFWVCBKBL-UHFFFAOYSA-N
Data  1 KI
  Tab Delimited (TSV)   2D SDfile   Computed 3D by Vconf -m prep SDfile
Find this compound or compounds like it in BindingDB:
Activity Spreadsheet -- Enzyme Inhibition Constant Data from BindingDB
Found 1 hit for monomerid = 50281473
TargetGag-Pol polyprotein [489-587](Human immunodeficiency virus type 1)
TBA
Curated by ChEMBL
LigandPNGBDBM50281473((3-Benzylcarbamoyl-3,3-difluoro-2-oxo-1-trimethyls...)
Affinity DataKi:  1.20E+4nM. Assay description: Tested for inhibitory activity against the recombinant HIV-1 protease
In DepthDetails Article