BDBM50281565 (S)-3-[(R)-2-((R)-2-Acetylamino-3-phenyl-propionylamino)-3-phenyl-propionylamino]-N-{(S)-1-[(S)-(S)-1-((S)-1-carboxy-2-(S)-1H-indol-3-yl-ethylcarbamoyl)-2-methyl-butylcarbamoyl]-2-methyl-butyl}-succinamic acid::CHEMBL146155
SMILES CC[C@H](C)[C@H](NC(=O)[C@H](CC(O)=O)NC(=O)[C@@H](Cc1ccccc1)NC(=O)[C@@H](Cc1ccccc1)NC(C)=O)C(=O)N[C@@H]([C@@H](C)CC)C(=O)N[C@@H](Cc1c[nH]c2ccccc12)C(O)=O
InChI Key InChIKey=GNRBLKLDFZWDTC-HVVAYYAISA-N
Data  2 IC50
  Tab Delimited (TSV)   2D SDfile   Computed 3D by Vconf -m prep SDfile
Find this compound or compounds like it in BindingDB:
Activity Spreadsheet -- Enzyme Inhibition Constant Data from BindingDB
Found 2 hits for monomerid = 50281565
TargetEndothelin receptor type B(RAT)
TBA
Curated by ChEMBL
LigandPNGBDBM50281565((S)-3-[(R)-2-((R)-2-Acetylamino-3-phenyl-propionyl...)
Affinity DataIC50:  30nM. Assay description: Displacement of [125I]-ET-1 from Endothelin B receptor of rat cerebellum
In DepthDetails Article
TargetEndothelin-1 receptor(Homo sapiens (Human))
TBA
Curated by ChEMBL
LigandPNGBDBM50281565((S)-3-[(R)-2-((R)-2-Acetylamino-3-phenyl-propionyl...)
Affinity DataIC50:  930nM. Assay description: Displacement of [125I]-ET-1 from Endothelin A receptor of rabbit renal artery vascular smooth muscle cells
In DepthDetails Article