BDBM50281781 Ac-Lys-Pro-Arg-Arg-Pro-Tyr-Ile-Leu-OH::CHEMBL264534
SMILES CC[C@@H](C)[C@H](NC(=O)[C@H](Cc1ccc(O)cc1)NC(=O)[C@@H]1CCCN1C(=O)[C@H](CCCNC(N)=N)NC(=O)[C@H](CCCNC(N)=N)NC(=O)[C@@H]1CCCN1C(=O)[C@H](CCCCN)NC(C)=O)C(=O)N[C@@H](CC(C)C)C(O)=O
InChI Key InChIKey=OYCOXIWUNFSKDJ-MNBFHEIESA-N
Data  1 KI
  Tab Delimited (TSV)   2D SDfile   Computed 3D by Vconf -m prep SDfile
Find this compound or compounds like it in BindingDB:
Activity Spreadsheet -- Enzyme Inhibition Constant Data from BindingDB
Found 1 hit for monomerid = 50281781
TargetNeurotensin receptor type 1(MOUSE)
TBA
Curated by ChEMBL
LigandPNGBDBM50281781(Ac-Lys-Pro-Arg-Arg-Pro-Tyr-Ile-Leu-OH | CHEMBL2645...)
Affinity DataKi:  0.0240nM. Assay description: Inhibition of specific binding of [125I]-Tyr3-NT(1-13) to NT receptors in neonatal mouse whole brain (minus cerebellum)
In DepthDetails Article