BDBM50281929 6-Amino-2-butyl-3-[2'-(1H-tetrazol-5-yl)-biphenyl-4-ylmethyl]-3H-quinazolin-4-one::6-Amino-2-butyl-3-[2'-(2H-tetrazol-5-yl)-biphenyl-4-ylmethyl]-3H-quinazolin-4-one::CHEMBL24724
SMILES CCCCc1nc2ccc(N)cc2c(=O)n1Cc1ccc(cc1)-c1ccccc1-c1nnn[nH]1
InChI Key InChIKey=WSWLWZSYKBAGMR-UHFFFAOYSA-N
Data  2 IC50
  Tab Delimited (TSV)   2D SDfile   Computed 3D by Vconf -m prep SDfile
Find this compound or compounds like it in BindingDB:
Activity Spreadsheet -- Enzyme Inhibition Constant Data from BindingDB
Found 2 hits for monomerid = 50281929
TargetType-1 angiotensin II receptor(RABBIT)
TBA
Curated by ChEMBL
LigandPNGBDBM50281929(6-Amino-2-butyl-3-[2'-(1H-tetrazol-5-yl)-biphenyl-...)
Affinity DataIC50:  1.30nM. Assay description: Binding affinity against Angiotensin II type 1 Receptor in rabbit aortic tissue
In DepthDetails Article
TargetType-1 angiotensin II receptor(RABBIT)
TBA
Curated by ChEMBL
LigandPNGBDBM50281929(6-Amino-2-butyl-3-[2'-(1H-tetrazol-5-yl)-biphenyl-...)
Affinity DataIC50:  1.30nM. Assay description: Ability to displace [125I]-Sar1-Ile8-AII from angiotensin II receptor, type 1 in rabbit aorta in presence of 0.2% bovine serum albumin (BSA) was dete...
In DepthDetails Article