BDBM50282214 7-Hydroxy-6-phenyl-4-[2'-(1H-tetrazol-5-yl)-biphenyl-4-ylmethyl]-4H-thieno[3,2-b]pyridin-5-one::CHEMBL26875
SMILES Oc1c(-c2ccccc2)c(=O)n(Cc2ccc(cc2)-c2ccccc2-c2nnn[nH]2)c2ccsc12
InChI Key InChIKey=FLGYVXAXNBHIQV-UHFFFAOYSA-N
Data  1 EC50
  Tab Delimited (TSV)   2D SDfile   Computed 3D by Vconf -m prep SDfile
Find this compound or compounds like it in BindingDB:
Activity Spreadsheet -- Enzyme Inhibition Constant Data from BindingDB
Found 1 hit for monomerid = 50282214
TargetType-1 angiotensin II receptor(Bos taurus)
TBA
Curated by ChEMBL
LigandPNGBDBM50282214(7-Hydroxy-6-phenyl-4-[2'-(1H-tetrazol-5-yl)-biphen...)
Affinity DataEC50:  6.00E+3nM. Assay description: Inhibition of [125I]-AII binding to angiotensin II receptor of bovine adrenal cortex
In DepthDetails Article