BDBM50282226 CHEMBL4160694
SMILES OC(=O)C(F)(F)F.OC1C(Br)=CC2(C=CNC3=C2C2=NCCc4c[nH]c(c24)C3=O)C=C1Br
InChI Key InChIKey=RZRKLCBSFPOTIQ-UHFFFAOYSA-N
Data  3 KI  3 IC50
  Tab Delimited (TSV)   2D SDfile   Computed 3D by Vconf -m prep SDfile
Find this compound or compounds like it in BindingDB:
Activity Spreadsheet -- Enzyme Inhibition Constant Data from BindingDB
Found 6 hits for monomerid = 50282226
TargetAcetylcholinesterase(Electrophorus electricus (Electric eel))
University Of Maribor
Curated by ChEMBL
LigandPNGBDBM50282226(CHEMBL4160694)
Affinity DataKi:  3.50E+3nM. Assay description: Reversible competitive inhibition of electric eel AChE using acetylthiocholine iodide as substrate measured over 5 mins by Dixon plot analysis
In DepthDetails ArticlePubMed
TargetCholinesterase(Equus caballus (Horse))
University Of Maribor
Curated by ChEMBL
LigandPNGBDBM50282226(CHEMBL4160694)
Affinity DataKi:  1.75E+4nM. Assay description: Inhibition of equine serum BChE using acetylthiocholine iodide as substrate measured over 5 mins by Dixon plot analysis
In DepthDetails ArticlePubMed
TargetAcetylcholinesterase(Homo sapiens (Human))
University Of Maribor
Curated by ChEMBL
LigandPNGBDBM50282226(CHEMBL4160694)
Affinity DataKi:  9.80E+4nM. Assay description: Reversible competitive inhibition of human AChE using acetylthiocholine iodide as substrate measured over 5 mins by Dixon plot analysis
In DepthDetails ArticlePubMed
TargetCholinesterase(Equus caballus (Horse))
University Of Maribor
Curated by ChEMBL
LigandPNGBDBM50282226(CHEMBL4160694)
Affinity DataIC50:  1.58E+4nM. Assay description: Histamine H1 receptor antagonistic activity on the isolated guinea pig ileum determined by Schild plot.
In DepthDetails ArticlePubMed
TargetAcetylcholinesterase(Electrophorus electricus (Electric eel))
University Of Maribor
Curated by ChEMBL
LigandPNGBDBM50282226(CHEMBL4160694)
Affinity DataIC50:  1.45E+4nM. Assay description: Binding activity against Endothelin A receptor of Porcine aortic smooth muscle membranes
In DepthDetails ArticlePubMed
TargetAcetylcholinesterase(Homo sapiens (Human))
University Of Maribor
Curated by ChEMBL
LigandPNGBDBM50282226(CHEMBL4160694)
Affinity DataIC50:  1.52E+5nM. Assay description: Binding activity against Endothelin A receptor of Porcine aortic smooth muscle membranes
In DepthDetails ArticlePubMed