BDBM50282333 5-Butyl-4-(3,5-dibromo-4-hydroxy-benzyl)-2-(2-trifluoromethyl-phenyl)-2,4-dihydro-[1,2,4]triazol-3-one::CHEMBL304655
SMILES CCCCc1nn(-c2ccccc2C(F)(F)F)c(=O)n1Cc1cc(Br)c(O)c(Br)c1
InChI Key InChIKey=BPBNAPMMJPPUIJ-UHFFFAOYSA-N
Data  1 IC50
  Tab Delimited (TSV)   2D SDfile   Computed 3D by Vconf -m prep SDfile
Find this compound or compounds like it in BindingDB:
Activity Spreadsheet -- Enzyme Inhibition Constant Data from BindingDB
Found 1 hit for monomerid = 50282333
TargetType-1 angiotensin II receptor(RABBIT)
TBA
Curated by ChEMBL
LigandPNGBDBM50282333(5-Butyl-4-(3,5-dibromo-4-hydroxy-benzyl)-2-(2-trif...)
Affinity DataIC50:  250nM. Assay description: Binding affinity evaluated by its ability to displace the specific binding ligand 125I-SAR1, Ile8-AII from Angiotensin II receptor, type 1 in rabbit ...
In DepthDetails Article