BDBM50282353 4-(2-Butyl-benzoimidazol-1-ylmethyl)-2,6-dimethyl-phenol::CHEMBL68713
SMILES CCCCc1nc2ccccc2n1Cc1cc(C)c(O)c(C)c1
InChI Key InChIKey=WORMXHLSZXGVKP-UHFFFAOYSA-N
Data  1 IC50
  Tab Delimited (TSV)   2D SDfile   Computed 3D by Vconf -m prep SDfile
Find this compound or compounds like it in BindingDB:
Activity Spreadsheet -- Enzyme Inhibition Constant Data from BindingDB
Found 1 hit for monomerid = 50282353
TargetType-1 angiotensin II receptor(Bos taurus)
TBA
Curated by ChEMBL
LigandPNGBDBM50282353(4-(2-Butyl-benzoimidazol-1-ylmethyl)-2,6-dimethyl-...)
Affinity DataIC50:  4.70E+3nM. Assay description: Inhibition of [125I]-[Ile5]-AII binding to bovine adrenal cortex membrane Angiotensin II receptor type 1
In DepthDetails Article