BDBM50282402 5-Benzyloxy-2-[2,2-bis-(4-chloro-phenyl)-acetyl]-6-methoxy-1,2,3,4-tetrahydro-isoquinoline-3-carboxylic acid::CHEMBL156165
SMILES COc1ccc2CN(C(Cc2c1OCc1ccccc1)C(O)=O)C(=O)C(c1ccc(Cl)cc1)c1ccc(Cl)cc1
InChI Key InChIKey=PJUPJKSRBKZKIZ-UHFFFAOYSA-N
Data  1 IC50
  Tab Delimited (TSV)   2D SDfile   Computed 3D by Vconf -m prep SDfile
Find this compound or compounds like it in BindingDB:
Activity Spreadsheet -- Enzyme Inhibition Constant Data from BindingDB
Found 1 hit for monomerid = 50282402
TargetType-2 angiotensin II receptor(Homo sapiens (Human))
TBA
Curated by ChEMBL
LigandPNGBDBM50282402(5-Benzyloxy-2-[2,2-bis-(4-chloro-phenyl)-acetyl]-6...)
Affinity DataIC50:  35nM. Assay description: Inhibitory activity against angiotensin II type 2 (AT2) receptor in rabbit uterine membranes.
In DepthDetails Article