BDBM50282426 2-Butyl-3-[2'-(cyclopropanecarbonyl-sulfamoyl)-biphenyl-4-ylmethyl]-3H-imidazole-4-carboxylic acid::CHEMBL349856
SMILES CCCCc1ncc(C(O)=O)n1Cc1ccc(cc1)-c1ccccc1S(=O)(=O)NC(=O)C1CC1
InChI Key InChIKey=TWPGGMFJTGIQQP-UHFFFAOYSA-N
Data  2 IC50
  Tab Delimited (TSV)   2D SDfile   Computed 3D by Vconf -m prep SDfile
Find this compound or compounds like it in BindingDB:
Activity Spreadsheet -- Enzyme Inhibition Constant Data from BindingDB
Found 2 hits for monomerid = 50282426
TargetType-2 angiotensin II receptor(RAT)
TBA
Curated by ChEMBL
LigandPNGBDBM50282426(2-Butyl-3-[2'-(cyclopropanecarbonyl-sulfamoyl)-bip...)
Affinity DataIC50:  5.80E+3nM. Assay description: In vitro inhibitory activity against angiotensin II (AT2) receptor to displace 125I-Sar,Ile8-AII in rat midbrain
In DepthDetails Article
TargetType-1 angiotensin II receptor(RABBIT)
TBA
Curated by ChEMBL
LigandPNGBDBM50282426(2-Butyl-3-[2'-(cyclopropanecarbonyl-sulfamoyl)-bip...)
Affinity DataIC50:  5.80nM. Assay description: In vitro inhibitory activity against Angiotensin II receptor, type 1 to displace 125I-Sar,Ile8-AII in rabbit aorta
In DepthDetails Article