BDBM50282428 3-(2'-Benzoylsulfamoyl-biphenyl-4-ylmethyl)-5-ethyl-2-propyl-3H-imidazole-4-carboxylic acid methyl ester::CHEMBL162148
SMILES CCCc1nc(CC)c(C(=O)OC)n1Cc1ccc(cc1)-c1ccccc1S(=O)(=O)NC(=O)c1ccccc1
InChI Key InChIKey=KVYDHNRTMQZMAY-UHFFFAOYSA-N
Data  2 IC50
  Tab Delimited (TSV)   2D SDfile   Computed 3D by Vconf -m prep SDfile
Find this compound or compounds like it in BindingDB:
Activity Spreadsheet -- Enzyme Inhibition Constant Data from BindingDB
Found 2 hits for monomerid = 50282428
TargetType-2 angiotensin II receptor(RAT)
TBA
Curated by ChEMBL
LigandPNGBDBM50282428(3-(2'-Benzoylsulfamoyl-biphenyl-4-ylmethyl)-5-ethy...)
Affinity DataIC50:  1.00E+3nM. Assay description: In vitro inhibitory activity against angiotensin II (AT2) receptor to displace 125I-Sar,Ile8-AII in rat midbrain
In DepthDetails Article
TargetType-1 angiotensin II receptor(RABBIT)
TBA
Curated by ChEMBL
LigandPNGBDBM50282428(3-(2'-Benzoylsulfamoyl-biphenyl-4-ylmethyl)-5-ethy...)
Affinity DataIC50:  0.5nM. Assay description: In vitro inhibitory activity against Angiotensin II receptor, type 1 to displace 125I-Sar,Ile8-AII in rabbit aorta
In DepthDetails Article