BDBM50282455 CHEMBL169967::Quinazolinone Analog
SMILES CCCCOC(=O)NS(=O)(=O)c1ccccc1-c1ccc(Cn2c(CCC)nc3ccc(NC(=O)N(C)C(C)C)cc3c2=O)cc1
InChI Key InChIKey=WPFDTJYMQILCJX-UHFFFAOYSA-N
Data  2 IC50
  Tab Delimited (TSV)   2D SDfile   Computed 3D by Vconf -m prep SDfile
Find this compound or compounds like it in BindingDB:
Activity Spreadsheet -- Enzyme Inhibition Constant Data from BindingDB
Found 2 hits for monomerid = 50282455
TargetType-2 angiotensin II receptor(RAT)
TBA
Curated by ChEMBL
LigandPNGBDBM50282455(CHEMBL169967 | Quinazolinone Analog)
Affinity DataIC50:  3.20nM. Assay description: In vitro for binding affinity against angiotensin II receptor type 2 in rat midbrain membrane
In DepthDetails Article
TargetType-1 angiotensin II receptor(RABBIT)
TBA
Curated by ChEMBL
LigandPNGBDBM50282455(CHEMBL169967 | Quinazolinone Analog)
Affinity DataIC50:  0.210nM. Assay description: Tested in vitro for binding affinity against Angiotensin II receptor, type 1 in rabbit aortic membrane
In DepthDetails Article