BDBM50282458 CHEMBL352947::Quinazolinone Analog
SMILES CCCCc1nc2ccc(NC(=O)N(C)C(C)C)cc2c(=O)n1Cc1ccc(cc1)-c1ccccc1S(=O)(=O)NC(=O)OCCC(C)C
InChI Key InChIKey=FRDFJOGXKADPIP-UHFFFAOYSA-N
Data  2 IC50
  Tab Delimited (TSV)   2D SDfile   Computed 3D by Vconf -m prep SDfile
Find this compound or compounds like it in BindingDB:
Activity Spreadsheet -- Enzyme Inhibition Constant Data from BindingDB
Found 2 hits for monomerid = 50282458
TargetType-2 angiotensin II receptor(RAT)
TBA
Curated by ChEMBL
LigandPNGBDBM50282458(CHEMBL352947 | Quinazolinone Analog)
Affinity DataIC50:  1.60nM. Assay description: In vitro for binding affinity against angiotensin II receptor type 2 in rat midbrain membrane
In DepthDetails Article
TargetType-1 angiotensin II receptor(RABBIT)
TBA
Curated by ChEMBL
LigandPNGBDBM50282458(CHEMBL352947 | Quinazolinone Analog)
Affinity DataIC50:  0.330nM. Assay description: Tested in vitro for binding affinity against Angiotensin II receptor, type 1 in rabbit aortic membrane
In DepthDetails Article