BDBM50282717 1-[(S)-2-((S)-2-Amino-3-phenyl-propionylamino)-4-methyl-pentanoyl]-pyrrolidine-2-carboxylic acid methyl ester::CHEMBL2372318
SMILES COC(=O)[C@@H]1CCCN1C(=O)[C@H](CC(C)C)NC(=O)[C@@H](N)Cc1ccccc1
InChI Key InChIKey=ZCHNPXDKOIRABB-BZSNNMDCSA-N
Data  2 IC50
  Tab Delimited (TSV)   2D SDfile   Computed 3D by Vconf -m prep SDfile
Find this compound or compounds like it in BindingDB:
Activity Spreadsheet -- Enzyme Inhibition Constant Data from BindingDB
Found 2 hits for monomerid = 50282717
TargetAminopeptidase N(Homo sapiens (Human))
TBA
Curated by ChEMBL
LigandPNGBDBM50282717(1-[(S)-2-((S)-2-Amino-3-phenyl-propionylamino)-4-m...)
Affinity DataIC50:  7.93E+5nM. Assay description: Inhibition of Aminopeptidase M.
In DepthDetails Article
TargetAminopeptidase B(Mus musculus)
TBA
Curated by ChEMBL
LigandPNGBDBM50282717(1-[(S)-2-((S)-2-Amino-3-phenyl-propionylamino)-4-m...)
Affinity DataIC50:  8.24E+5nM. Assay description: Inhibition of Aminopeptidase B in murine L-cells by Aoyagi method.
In DepthDetails Article