BDBM50282724 (S)-2-((1R,2S)-2-Amino-1-carbamoyl-3-phenyl-propylamino)-4-methyl-pentanoic acid methyl ester::CHEMBL290459
SMILES COC(=O)[C@H](CC(C)C)N[C@@H]([C@@H](N)Cc1ccccc1)C(N)=O
InChI Key InChIKey=MMMZTXZOLMOFPX-KKUMJFAQSA-N
Data  2 IC50
  Tab Delimited (TSV)   2D SDfile   Computed 3D by Vconf -m prep SDfile
Find this compound or compounds like it in BindingDB:
Activity Spreadsheet -- Enzyme Inhibition Constant Data from BindingDB
Found 2 hits for monomerid = 50282724
TargetAminopeptidase B(Mus musculus)
TBA
Curated by ChEMBL
LigandPNGBDBM50282724((S)-2-((1R,2S)-2-Amino-1-carbamoyl-3-phenyl-propyl...)
Affinity DataIC50:  1.00E+6nM. Assay description: Inhibition of Aminopeptidase B in murine L-cells by Aoyagi method.
In DepthDetails Article
TargetAminopeptidase N(Homo sapiens (Human))
TBA
Curated by ChEMBL
LigandPNGBDBM50282724((S)-2-((1R,2S)-2-Amino-1-carbamoyl-3-phenyl-propyl...)
Affinity DataIC50:  1.00E+6nM. Assay description: Inhibition of Aminopeptidase M.
In DepthDetails Article