BDBM50282725 CHEMBL35627::methyl (2S)-2-{[(2S)-2-amino-1-cyano-3-phenylpropyl]amino}-3-methylbutanoate
SMILES COC(=O)[C@@H](NC(C#N)[C@@H](N)Cc1ccccc1)C(C)C
InChI Key InChIKey=CNMMIYOITUYCNC-LWEDLAQUSA-N
Data  2 IC50
  Tab Delimited (TSV)   2D SDfile   Computed 3D by Vconf -m prep SDfile
Find this compound or compounds like it in BindingDB:
Activity Spreadsheet -- Enzyme Inhibition Constant Data from BindingDB
Found 2 hits for monomerid = 50282725
TargetAminopeptidase B(Mus musculus)
TBA
Curated by ChEMBL
LigandPNGBDBM50282725(CHEMBL35627 | methyl (2S)-2-{[(2S)-2-amino-1-cyano...)
Affinity DataIC50:  3.60E+4nM. Assay description: Inhibition of Aminopeptidase B in murine L-cells by Aoyagi method.
In DepthDetails Article
TargetAminopeptidase N(Homo sapiens (Human))
TBA
Curated by ChEMBL
LigandPNGBDBM50282725(CHEMBL35627 | methyl (2S)-2-{[(2S)-2-amino-1-cyano...)
Affinity DataIC50:  3.80E+3nM. Assay description: Inhibition of Aminopeptidase M.
In DepthDetails Article