BDBM50282791 2-Butyl-6-((2R,3aR)-2-methyl-hexahydro-pyrrolo[1,2-b]isoxazol-2-yl)-3-[2'-(1H-tetrazol-5-yl)-biphenyl-4-ylmethyl]-3H-quinazolin-4-one::CHEMBL295532
SMILES CCCCc1nc2ccc(cc2c(=O)n1Cc1ccc(cc1)-c1ccccc1-c1nnn[nH]1)[C@@]1(C)C[C@H]2CCCN2O1
InChI Key InChIKey=AAZOKMBAJGOCHB-INJOXJOKSA-N
Data  1 IC50
  Tab Delimited (TSV)   2D SDfile   Computed 3D by Vconf -m prep SDfile
Find this compound or compounds like it in BindingDB:
Activity Spreadsheet -- Enzyme Inhibition Constant Data from BindingDB
Found 1 hit for monomerid = 50282791
TargetType-1 angiotensin II receptor(Bos taurus)
TBA
Curated by ChEMBL
LigandPNGBDBM50282791(2-Butyl-6-((2R,3aR)-2-methyl-hexahydro-pyrrolo[1,2...)
Affinity DataIC50:  55nM. Assay description: In vitro Angiotensin II receptor antagonism in bovine adrenal cortex tissue.
In DepthDetails Article