BDBM50282879 2-Butyl-6-((R)-2-methyl-hexahydro-cyclopenta[d]isoxazol-3-yl)-3-[2'-(1H-tetrazol-5-yl)-biphenyl-4-ylmethyl]-3H-quinazolin-4-one::CHEMBL53803
SMILES CCCCc1nc2ccc(cc2c(=O)n1Cc1ccc(cc1)-c1ccccc1-c1nnn[nH]1)[C@H]1C2CCCC2ON1C
InChI Key InChIKey=HFSBXIQXFLGAIT-RKQLGKQKSA-N
Data  1 IC50
  Tab Delimited (TSV)   2D SDfile   Computed 3D by Vconf -m prep SDfile
Find this compound or compounds like it in BindingDB:
Activity Spreadsheet -- Enzyme Inhibition Constant Data from BindingDB
Found 1 hit for monomerid = 50282879
TargetType-1 angiotensin II receptor(Bos taurus)
TBA
Curated by ChEMBL
LigandPNGBDBM50282879(2-Butyl-6-((R)-2-methyl-hexahydro-cyclopenta[d]iso...)
Affinity DataIC50:  154nM. Assay description: In vitro binding affinity to angiotensin II receptor in bovine adrenal cortex
In DepthDetails Article