BDBM50282999 4'-(5-Acetyl-4-ethyl-2-propyl-imidazol-1-ylmethyl)-3'-chloro-biphenyl-2-sulfonic acid N-(butyloxycarbonyl)amide::CHEMBL431137
SMILES CCCCOC(=O)NS(=O)(=O)c1ccccc1-c1ccc(Cn2c(CCC)nc(CC)c2C(C)=O)c(Cl)c1
InChI Key InChIKey=DGCCTQPPHYVGDJ-UHFFFAOYSA-N
Data  2 IC50
  Tab Delimited (TSV)   2D SDfile   Computed 3D by Vconf -m prep SDfile
Find this compound or compounds like it in BindingDB:
Activity Spreadsheet -- Enzyme Inhibition Constant Data from BindingDB
Found 2 hits for monomerid = 50282999
LigandPNGBDBM50282999(4'-(5-Acetyl-4-ethyl-2-propyl-imidazol-1-ylmethyl)...)
Affinity DataIC50:  6nM. Assay description: Displacement of [125I]- Ang II from angiotensin II AT1 receptor in rat adrenal cortical microsomes
In DepthDetails Article
TargetType-2 angiotensin II receptor(RAT)
TBA
Curated by ChEMBL
LigandPNGBDBM50282999(4'-(5-Acetyl-4-ethyl-2-propyl-imidazol-1-ylmethyl)...)
Affinity DataIC50:  12nM. Assay description: Displacement of [125I]- Ang II from angiotensin II AT2 receptor in rat adrenal cortical microsomes
In DepthDetails Article