BDBM50283057 (1R,5S,6R,7R)-6-((Z)-7-Hydroxy-hept-2-enyl)-7-((E)-3-hydroxy-oct-1-enyl)-2,4-dioxa-bicyclo[3.2.1]octan-3-one::CHEMBL63892
SMILES CCCCCC(O)\C=C\[C@H]1[C@H]2C[C@H](OC(=O)O2)[C@@H]1C\C=C/CCCCO
InChI Key InChIKey=PTIUXNGGNGQHQK-OMRNEDSISA-N
Data  1 EC50
  Tab Delimited (TSV)   2D SDfile   Computed 3D by Vconf -m prep SDfile
Find this compound or compounds like it in BindingDB:
Activity Spreadsheet -- Enzyme Inhibition Constant Data from BindingDB
Found 1 hit for monomerid = 50283057
TargetThromboxane A2 receptor(RAT)
TBA
Curated by ChEMBL
LigandPNGBDBM50283057((1R,5S,6R,7R)-6-((Z)-7-Hydroxy-hept-2-enyl)-7-((E)...)
Affinity DataEC50:  1nM. Assay description: Activity of the compound against thromboxane A2 receptor evaluated by contraction of isolated rat thoracic aorta
In DepthDetails Article