BDBM50283221 Biphenylsulfonylcarbamate compound::CHEMBL70793
SMILES CCCc1nc(CC)c(C(=O)OCc2ccccc2-c2ccccc2)n1Cc1ccc(cc1F)-c1ccccc1S(=O)(=O)NC(=O)OCCC(C)C
InChI Key InChIKey=BQVHWPHYIQLCCW-UHFFFAOYSA-N
Data  2 IC50
  Tab Delimited (TSV)   2D SDfile   Computed 3D by Vconf -m prep SDfile
Find this compound or compounds like it in BindingDB:
Activity Spreadsheet -- Enzyme Inhibition Constant Data from BindingDB
Found 2 hits for monomerid = 50283221
TargetType-1 angiotensin II receptor(Homo sapiens (Human))
TBA
Curated by ChEMBL
LigandPNGBDBM50283221(Biphenylsulfonylcarbamate compound | CHEMBL70793)
Affinity DataIC50:  3nM. Assay description: Binding affinity for Angiotensin II receptor, type 1
In DepthDetails Article
TargetType-2 angiotensin II receptor(Homo sapiens (Human))
TBA
Curated by ChEMBL
LigandPNGBDBM50283221(Biphenylsulfonylcarbamate compound | CHEMBL70793)
Affinity DataIC50:  9nM. Assay description: Binding affinity for angiotensin II AT-2 receptor
In DepthDetails Article