BDBM50283255 (S)-2-[(5-Oxo-pyrrolidine-2-carbonyl)-amino]-pentanedioic acid 5-amide 1-({(S)-1-[(S)-1-({[(S)-1-((E)-(S)-1-carbamoyl-hex-4-enylcarbamoyl)-3-methyl-butylcarbamoyl]-methyl}-carbamoyl)-2-phenyl-ethylcarbamoyl]-2-phenyl-ethyl}-amide)::CHEMBL2369767
SMILES C\C=C\CC[C@H](NC(=O)[C@H](CC(C)C)NC(=O)CNC(=O)[C@H](Cc1ccccc1)NC(=O)[C@H](Cc1ccccc1)NC(=O)[C@H](CCC(N)=O)NC(=O)[C@@H]1CCC(=O)N1)C(N)=O
InChI Key InChIKey=DSZWJUAPIPRUDO-IPFBOOAKSA-N
Data  3 IC50
  Tab Delimited (TSV)   2D SDfile   Computed 3D by Vconf -m prep SDfile
Find this compound or compounds like it in BindingDB:
Activity Spreadsheet -- Enzyme Inhibition Constant Data from BindingDB
Found 3 hits for monomerid = 50283255
TargetSubstance-K receptor(HAMSTER)
TBA
Curated by ChEMBL
LigandPNGBDBM50283255((S)-2-[(5-Oxo-pyrrolidine-2-carbonyl)-amino]-penta...)
Affinity DataIC50:  2.90E+3nM. Assay description: Concentration producing half-maximal inhibition of specific binding of. [125I]-Neurokinin A to NK-2 receptors in the hamster urinary bladder
In DepthDetails Article
TargetNeuromedin-K receptor(GUINEA PIG)
TBA
Curated by ChEMBL
LigandPNGBDBM50283255((S)-2-[(5-Oxo-pyrrolidine-2-carbonyl)-amino]-penta...)
Affinity DataIC50:  1.88E+3nM. Assay description: Concentration producing half-maximal inhibition of specific binding of [3H]-Senktide to Tachykinin receptor 3 in the guinea pig cerebral cortex
In DepthDetails Article
TargetSubstance-P receptor(GUINEA PIG)
TBA
Curated by ChEMBL
LigandPNGBDBM50283255((S)-2-[(5-Oxo-pyrrolidine-2-carbonyl)-amino]-penta...)
Affinity DataIC50:  366nM. Assay description: Concentration producing half-maximal inhibition of specific binding of. [125I]-Bolton-Hunter Substance P to NK-1 receptors in the guinea pig cerebral...
In DepthDetails Article